![]() |
| Summary | |
|---|---|
| Suite / Plan | CTS / cts-retry |
| Suite / Build | 9.0_r6 / 5299617 |
| Host Info | Result/@start amlogic-OptiPlex-7060 (Linux - 4.15.0-46-generic) |
| Start time / End Time | Tue Mar 12 20:05:08 CST 2019 / Tue Mar 12 20:23:08 CST 2019 |
| Tests Passed | 475514 |
| Tests Failed | 16 |
| Modules Done | 320 |
| Modules Total | 320 |
| Fingerprint | Amlogic/franklin/franklin:9/PI/20190311:user/release-keys |
| Security Patch | 2019-02-05 |
| Release (SDK) | 9 (28) |
| ABIs | armeabi-v7a,armeabi |
| Module | Passed | Failed | Total Tests | Done |
|---|---|---|---|---|
| armeabi-v7a CtsAbiOverrideHostTestCases | 1 | 0 | 1 | true |
| armeabi-v7a CtsAccelerationTestCases | 6 | 0 | 6 | true |
| armeabi-v7a CtsAccessibilityServiceTestCases | 140 | 0 | 140 | true |
| armeabi-v7a CtsAccessibilityTestCases | 43 | 0 | 43 | true |
| armeabi-v7a CtsAccountManagerTestCases | 151 | 0 | 151 | true |
| armeabi-v7a CtsActivityManagerDeviceSdk25TestCases | 1 | 0 | 1 | true |
| armeabi-v7a CtsActivityManagerDeviceTestCases | 314 | 0 | 314 | true |
| armeabi-v7a CtsAdminPackageInstallerTestCases | 6 | 0 | 6 | true |
| armeabi-v7a CtsAdminTestCases | 83 | 0 | 83 | true |
| armeabi-v7a CtsAlarmClockTestCases | 4 | 0 | 4 | true |
| armeabi-v7a CtsAlarmManagerTestCases | 9 | 0 | 9 | true |
| armeabi-v7a CtsAndroidAppTestCases | 5 | 0 | 5 | true |
| armeabi-v7a CtsAndroidTestBase27ApiSignatureTestCases | 1 | 0 | 1 | true |
| armeabi-v7a CtsAndroidTestMockCurrentApiSignatureTestCases | 1 | 0 | 1 | true |
| armeabi-v7a CtsAndroidTestRunnerCurrentApiSignatureTestCases | 1 | 0 | 1 | true |
| armeabi-v7a CtsAnimationTestCases | 144 | 0 | 144 | true |
| armeabi-v7a CtsApacheHttpLegacy27ApiSignatureTestCases | 1 | 0 | 1 | true |
| armeabi-v7a CtsApacheHttpLegacyCurrentApiSignatureTestCases | 1 | 0 | 1 | true |
| armeabi-v7a CtsApacheHttpLegacyUsesLibraryApiSignatureTestCases | 1 | 0 | 1 | true |
| armeabi-v7a CtsAppComponentFactoryTestCases | 4 | 0 | 4 | true |
| armeabi-v7a CtsAppSecurityHostTestCases | 288 | 0 | 288 | true |
| armeabi-v7a CtsAppTestCases | 473 | 0 | 473 | true |
| armeabi-v7a CtsAppUsageHostTestCases | 5 | 0 | 5 | true |
| armeabi-v7a CtsAppWidgetTestCases | 28 | 0 | 28 | true |
| armeabi-v7a CtsAslrMallocTestCases | 1 | 0 | 1 | true |
| armeabi-v7a CtsAssistTestCases | 14 | 0 | 14 | true |
| armeabi-v7a CtsAtraceHostTestCases | 3 | 0 | 3 | true |
| armeabi-v7a CtsAutoFillServiceTestCases | 571 | 0 | 571 | true |
| armeabi-v7a CtsBackgroundRestrictionsTestCases | 2 | 0 | 2 | true |
| armeabi-v7a CtsBackupHostTestCases | 16 | 0 | 16 | true |
| armeabi-v7a CtsBackupTestCases | 6 | 0 | 6 | true |
| armeabi-v7a CtsBatterySavingTestCases | 5 | 0 | 5 | true |
| armeabi-v7a CtsBionicTestCases | 2708 | 0 | 2708 | true |
| armeabi-v7a CtsBluetoothTestCases | 44 | 0 | 44 | true |
| armeabi-v7a CtsBootStatsTestCases | 1 | 0 | 1 | true |
| armeabi-v7a CtsCalendarcommon2TestCases | 1 | 0 | 1 | true |
| armeabi-v7a CtsCameraApi25TestCases | 1 | 0 | 1 | true |
| armeabi-v7a CtsCameraTestCases | 253 | 0 | 253 | true |
| armeabi-v7a CtsCarTestCases | 6 | 0 | 6 | true |
| armeabi-v7a CtsCarrierApiTestCases | 20 | 0 | 20 | true |
| armeabi-v7a CtsColorModeTestCases | 3 | 0 | 3 | true |
| armeabi-v7a CtsCompilationTestCases | 5 | 0 | 5 | true |
| armeabi-v7a CtsContactsProviderWipe | 3 | 0 | 3 | true |
| armeabi-v7a CtsContentTestCases | 747 | 0 | 747 | true |
| armeabi-v7a CtsCppToolsTestCases | 1 | 0 | 1 | true |
| armeabi-v7a CtsCurrentApiSignatureTestCases | 1 | 0 | 1 | true |
| armeabi-v7a CtsDatabaseTestCases | 260 | 0 | 260 | true |
| armeabi-v7a CtsDebugTestCases | 3 | 0 | 3 | true |
| armeabi-v7a CtsDeqpTestCases | 382575 | 1 | 382576 | true |
| armeabi-v7a CtsDeviceIdleHostTestCases | 2 | 0 | 2 | true |
| armeabi-v7a CtsDevicePolicyManagerTestCases | 357 | 0 | 357 | true |
| armeabi-v7a CtsDexMetadataHostTestCases | 7 | 0 | 7 | true |
| armeabi-v7a CtsDisplayTestCases | 21 | 0 | 21 | true |
| armeabi-v7a CtsDpiTestCases | 9 | 0 | 9 | true |
| armeabi-v7a CtsDpiTestCases2 | 6 | 0 | 6 | true |
| armeabi-v7a CtsDreamsTestCases | 3 | 0 | 3 | true |
| armeabi-v7a CtsDrmTestCases | 42 | 0 | 42 | true |
| armeabi-v7a CtsDumpsysHostTestCases | 4 | 0 | 4 | true |
| armeabi-v7a CtsDynamicLinkerTestCases | 2 | 0 | 2 | true |
| armeabi-v7a CtsEdiHostTestCases | 2 | 0 | 2 | true |
| armeabi-v7a CtsEffectTestCases | 6 | 0 | 6 | true |
| armeabi-v7a CtsExternalServiceTestCases | 9 | 0 | 9 | true |
| armeabi-v7a CtsExternalSourcesTestCases | 4 | 0 | 4 | true |
| armeabi-v7a CtsFileSystemTestCases | 5 | 0 | 5 | true |
| armeabi-v7a CtsFragmentTestCases | 155 | 0 | 155 | true |
| armeabi-v7a CtsFragmentTestCasesSdk26 | 1 | 0 | 1 | true |
| armeabi-v7a CtsGestureTestCases | 29 | 0 | 29 | true |
| armeabi-v7a CtsGpuToolsHostTestCases | 7 | 0 | 7 | true |
| armeabi-v7a CtsGraphicsTestCases | 1683 | 0 | 1683 | true |
| armeabi-v7a CtsHardwareTestCases | 17 | 0 | 17 | true |
| armeabi-v7a CtsHarmfulAppWarningHostTestCases | 4 | 0 | 4 | true |
| armeabi-v7a CtsHiddenApiBlacklistApi27TestCases | 1 | 0 | 1 | true |
| armeabi-v7a CtsHiddenApiBlacklistCurrentApiTestCases | 1 | 0 | 1 | true |
| armeabi-v7a CtsHiddenApiBlacklistDebugClassTestCases | 1 | 0 | 1 | true |
| armeabi-v7a CtsHiddenApiKillswitchDebugClassTestCases | 1 | 0 | 1 | true |
| armeabi-v7a CtsHiddenApiKillswitchWhitelistTestCases | 1 | 0 | 1 | true |
| armeabi-v7a CtsHiddenApiKillswitchWildcardTestCases | 1 | 0 | 1 | true |
| armeabi-v7a CtsHostTzDataTests | 23 | 0 | 23 | true |
| armeabi-v7a CtsHostsideNetworkTests | 41 | 0 | 41 | true |
| armeabi-v7a CtsHostsideNumberBlockingTestCases | 1 | 0 | 1 | true |
| armeabi-v7a CtsHostsideTvTests | 1 | 0 | 1 | true |
| armeabi-v7a CtsHostsideWebViewTests | 7 | 0 | 7 | true |
| armeabi-v7a CtsIcuTestCases | 3615 | 0 | 3615 | true |
| armeabi-v7a CtsIncidentHostTestCases | 42 | 4 | 46 | true |
| armeabi-v7a CtsInlineMockingTestCases | 61 | 0 | 61 | true |
| armeabi-v7a CtsInputMethodServiceHostTestCases | 8 | 0 | 8 | true |
| armeabi-v7a CtsInputMethodTestCases | 62 | 0 | 62 | true |
| armeabi-v7a CtsIntentSignatureTestCases | 1 | 0 | 1 | true |
| armeabi-v7a CtsJankDeviceTestCases | 1 | 0 | 1 | true |
| armeabi-v7a CtsJdwpSecurityHostTestCases | 1 | 0 | 1 | true |
| armeabi-v7a CtsJdwpTestCases | 379 | 0 | 379 | true |
| armeabi-v7a CtsJniTestCases | 65 | 0 | 65 | true |
| armeabi-v7a CtsJobSchedulerSharedUidTestCases | 13 | 0 | 13 | true |
| armeabi-v7a CtsJobSchedulerTestCases | 27 | 0 | 27 | true |
| armeabi-v7a CtsJvmtiAttachingHostTestCases | 4 | 0 | 4 | true |
| armeabi-v7a CtsJvmtiAttachingTestCases | 28 | 0 | 28 | true |
| armeabi-v7a CtsJvmtiRedefineClassesHostTestCases | 1 | 0 | 1 | true |
| armeabi-v7a CtsJvmtiRunTest1900HostTestCases | 1 | 0 | 1 | true |
| armeabi-v7a CtsJvmtiRunTest1901HostTestCases | 1 | 0 | 1 | true |
| armeabi-v7a CtsJvmtiRunTest1902HostTestCases | 1 | 0 | 1 | true |
| armeabi-v7a CtsJvmtiRunTest1903HostTestCases | 1 | 0 | 1 | true |
| armeabi-v7a CtsJvmtiRunTest1904HostTestCases | 1 | 0 | 1 | true |
| armeabi-v7a CtsJvmtiRunTest1906HostTestCases | 1 | 0 | 1 | true |
| armeabi-v7a CtsJvmtiRunTest1907HostTestCases | 1 | 0 | 1 | true |
| armeabi-v7a CtsJvmtiRunTest1908HostTestCases | 1 | 0 | 1 | true |
| armeabi-v7a CtsJvmtiRunTest1909HostTestCases | 1 | 0 | 1 | true |
| armeabi-v7a CtsJvmtiRunTest1910HostTestCases | 1 | 0 | 1 | true |
| armeabi-v7a CtsJvmtiRunTest1911HostTestCases | 1 | 0 | 1 | true |
| armeabi-v7a CtsJvmtiRunTest1912HostTestCases | 1 | 0 | 1 | true |
| armeabi-v7a CtsJvmtiRunTest1913HostTestCases | 1 | 0 | 1 | true |
| armeabi-v7a CtsJvmtiRunTest1914HostTestCases | 1 | 0 | 1 | true |
| armeabi-v7a CtsJvmtiRunTest1915HostTestCases | 1 | 0 | 1 | true |
| armeabi-v7a CtsJvmtiRunTest1916HostTestCases | 1 | 0 | 1 | true |
| armeabi-v7a CtsJvmtiRunTest1917HostTestCases | 1 | 0 | 1 | true |
| armeabi-v7a CtsJvmtiRunTest1920HostTestCases | 1 | 0 | 1 | true |
| armeabi-v7a CtsJvmtiRunTest1921HostTestCases | 1 | 0 | 1 | true |
| armeabi-v7a CtsJvmtiRunTest1922HostTestCases | 1 | 0 | 1 | true |
| armeabi-v7a CtsJvmtiRunTest1923HostTestCases | 1 | 0 | 1 | true |
| armeabi-v7a CtsJvmtiRunTest1924HostTestCases | 1 | 0 | 1 | true |
| armeabi-v7a CtsJvmtiRunTest1925HostTestCases | 1 | 0 | 1 | true |
| armeabi-v7a CtsJvmtiRunTest1926HostTestCases | 1 | 0 | 1 | true |
| armeabi-v7a CtsJvmtiRunTest1927HostTestCases | 1 | 0 | 1 | true |
| armeabi-v7a CtsJvmtiRunTest1928HostTestCases | 1 | 0 | 1 | true |
| armeabi-v7a CtsJvmtiRunTest1930HostTestCases | 1 | 0 | 1 | true |
| armeabi-v7a CtsJvmtiRunTest1931HostTestCases | 1 | 0 | 1 | true |
| armeabi-v7a CtsJvmtiRunTest1932HostTestCases | 1 | 0 | 1 | true |
| armeabi-v7a CtsJvmtiRunTest1933HostTestCases | 1 | 0 | 1 | true |
| armeabi-v7a CtsJvmtiRunTest1934HostTestCases | 1 | 0 | 1 | true |
| armeabi-v7a CtsJvmtiRunTest1936HostTestCases | 1 | 0 | 1 | true |
| armeabi-v7a CtsJvmtiRunTest1937HostTestCases | 1 | 0 | 1 | true |
| armeabi-v7a CtsJvmtiRunTest1939HostTestCases | 1 | 0 | 1 | true |
| armeabi-v7a CtsJvmtiRunTest1941HostTestCases | 1 | 0 | 1 | true |
| armeabi-v7a CtsJvmtiRunTest1942HostTestCases | 1 | 0 | 1 | true |
| armeabi-v7a CtsJvmtiRunTest1943HostTestCases | 1 | 0 | 1 | true |
| armeabi-v7a CtsJvmtiRunTest902HostTestCases | 1 | 0 | 1 | true |
| armeabi-v7a CtsJvmtiRunTest903HostTestCases | 1 | 0 | 1 | true |
| armeabi-v7a CtsJvmtiRunTest904HostTestCases | 1 | 0 | 1 | true |
| armeabi-v7a CtsJvmtiRunTest905HostTestCases | 1 | 0 | 1 | true |
| armeabi-v7a CtsJvmtiRunTest906HostTestCases | 1 | 0 | 1 | true |
| armeabi-v7a CtsJvmtiRunTest907HostTestCases | 1 | 0 | 1 | true |
| armeabi-v7a CtsJvmtiRunTest908HostTestCases | 1 | 0 | 1 | true |
| armeabi-v7a CtsJvmtiRunTest910HostTestCases | 1 | 0 | 1 | true |
| armeabi-v7a CtsJvmtiRunTest911HostTestCases | 1 | 0 | 1 | true |
| armeabi-v7a CtsJvmtiRunTest912HostTestCases | 1 | 0 | 1 | true |
| armeabi-v7a CtsJvmtiRunTest913HostTestCases | 1 | 0 | 1 | true |
| armeabi-v7a CtsJvmtiRunTest914HostTestCases | 1 | 0 | 1 | true |
| armeabi-v7a CtsJvmtiRunTest915HostTestCases | 1 | 0 | 1 | true |
| armeabi-v7a CtsJvmtiRunTest917HostTestCases | 1 | 0 | 1 | true |
| armeabi-v7a CtsJvmtiRunTest918HostTestCases | 1 | 0 | 1 | true |
| armeabi-v7a CtsJvmtiRunTest919HostTestCases | 1 | 0 | 1 | true |
| armeabi-v7a CtsJvmtiRunTest920HostTestCases | 1 | 0 | 1 | true |
| armeabi-v7a CtsJvmtiRunTest922HostTestCases | 1 | 0 | 1 | true |
| armeabi-v7a CtsJvmtiRunTest923HostTestCases | 1 | 0 | 1 | true |
| armeabi-v7a CtsJvmtiRunTest924HostTestCases | 1 | 0 | 1 | true |
| armeabi-v7a CtsJvmtiRunTest926HostTestCases | 1 | 0 | 1 | true |
| armeabi-v7a CtsJvmtiRunTest927HostTestCases | 1 | 0 | 1 | true |
| armeabi-v7a CtsJvmtiRunTest928HostTestCases | 1 | 0 | 1 | true |
| armeabi-v7a CtsJvmtiRunTest930HostTestCases | 1 | 0 | 1 | true |
| armeabi-v7a CtsJvmtiRunTest931HostTestCases | 1 | 0 | 1 | true |
| armeabi-v7a CtsJvmtiRunTest932HostTestCases | 1 | 0 | 1 | true |
| armeabi-v7a CtsJvmtiRunTest940HostTestCases | 1 | 0 | 1 | true |
| armeabi-v7a CtsJvmtiRunTest942HostTestCases | 1 | 0 | 1 | true |
| armeabi-v7a CtsJvmtiRunTest944HostTestCases | 1 | 0 | 1 | true |
| armeabi-v7a CtsJvmtiRunTest945HostTestCases | 1 | 0 | 1 | true |
| armeabi-v7a CtsJvmtiRunTest947HostTestCases | 1 | 0 | 1 | true |
| armeabi-v7a CtsJvmtiRunTest951HostTestCases | 1 | 0 | 1 | true |
| armeabi-v7a CtsJvmtiRunTest982HostTestCases | 1 | 0 | 1 | true |
| armeabi-v7a CtsJvmtiRunTest983HostTestCases | 1 | 0 | 1 | true |
| armeabi-v7a CtsJvmtiRunTest984HostTestCases | 1 | 0 | 1 | true |
| armeabi-v7a CtsJvmtiRunTest985HostTestCases | 1 | 0 | 1 | true |
| armeabi-v7a CtsJvmtiRunTest986HostTestCases | 1 | 0 | 1 | true |
| armeabi-v7a CtsJvmtiRunTest988HostTestCases | 1 | 0 | 1 | true |
| armeabi-v7a CtsJvmtiRunTest989HostTestCases | 1 | 0 | 1 | true |
| armeabi-v7a CtsJvmtiRunTest990HostTestCases | 1 | 0 | 1 | true |
| armeabi-v7a CtsJvmtiRunTest991HostTestCases | 1 | 0 | 1 | true |
| armeabi-v7a CtsJvmtiRunTest992HostTestCases | 1 | 0 | 1 | true |
| armeabi-v7a CtsJvmtiRunTest993HostTestCases | 1 | 0 | 1 | true |
| armeabi-v7a CtsJvmtiRunTest994HostTestCases | 1 | 0 | 1 | true |
| armeabi-v7a CtsJvmtiRunTest995HostTestCases | 1 | 0 | 1 | true |
| armeabi-v7a CtsJvmtiRunTest996HostTestCases | 1 | 0 | 1 | true |
| armeabi-v7a CtsJvmtiRunTest997HostTestCases | 1 | 0 | 1 | true |
| armeabi-v7a CtsJvmtiTaggingHostTestCases | 1 | 0 | 1 | true |
| armeabi-v7a CtsJvmtiTrackingHostTestCases | 1 | 0 | 1 | true |
| armeabi-v7a CtsKernelConfigTestCases | 5 | 0 | 5 | true |
| armeabi-v7a CtsKeystoreTestCases | 1011 | 0 | 1011 | true |
| armeabi-v7a CtsLeanbackJankTestCases | 1 | 0 | 1 | true |
| armeabi-v7a CtsLibcoreFileIOTestCases | 18 | 0 | 18 | true |
| armeabi-v7a CtsLibcoreJsr166TestCases | 3365 | 0 | 3365 | true |
| armeabi-v7a CtsLibcoreLegacy22TestCases | 5 | 0 | 5 | true |
| armeabi-v7a CtsLibcoreOjTestCases | 3977 | 0 | 3977 | true |
| armeabi-v7a CtsLibcoreOkHttpTestCases | 1995 | 0 | 1995 | true |
| armeabi-v7a CtsLibcoreTestCases | 22979 | 7 | 22986 | true |
| armeabi-v7a CtsLibcoreWycheproofBCTestCases | 52 | 0 | 52 | true |
| armeabi-v7a CtsLibcoreWycheproofConscryptTestCases | 40 | 0 | 40 | true |
| armeabi-v7a CtsLiblogTestCases | 155 | 0 | 155 | true |
| armeabi-v7a CtsLocation2TestCases | 12 | 0 | 12 | true |
| armeabi-v7a CtsLocationTestCases | 145 | 0 | 145 | true |
| armeabi-v7a CtsLogdTestCases | 13 | 0 | 13 | true |
| armeabi-v7a CtsMediaBitstreamsTestCases | 4541 | 0 | 4541 | true |
| armeabi-v7a CtsMediaHostTestCases | 4 | 0 | 4 | true |
| armeabi-v7a CtsMediaStressTestCases | 120 | 0 | 120 | true |
| armeabi-v7a CtsMediaTestCases | 2160 | 0 | 2160 | true |
| armeabi-v7a CtsMidiTestCases | 7 | 0 | 7 | true |
| armeabi-v7a CtsMockingDebuggableTestCases | 26 | 0 | 26 | true |
| armeabi-v7a CtsMockingTestCases | 26 | 0 | 26 | true |
| armeabi-v7a CtsMonkeyTestCases | 10 | 0 | 10 | true |
| armeabi-v7a CtsMultiUserHostTestCases | 6 | 0 | 6 | true |
| armeabi-v7a CtsMultiUserTestCases | 1 | 0 | 1 | true |
| armeabi-v7a CtsNNAPITestCases | 16796 | 0 | 16796 | true |
| armeabi-v7a CtsNativeHardwareTestCases | 263 | 0 | 263 | true |
| armeabi-v7a CtsNativeMediaAAudioTestCases | 120 | 0 | 120 | true |
| armeabi-v7a CtsNativeMediaSlTestCases | 10 | 0 | 10 | true |
| armeabi-v7a CtsNativeMediaXaTestCases | 2 | 0 | 2 | true |
| armeabi-v7a CtsNativeNetTestCases | 3 | 0 | 3 | true |
| armeabi-v7a CtsNdefTestCases | 11 | 0 | 11 | true |
| armeabi-v7a CtsNetSecConfigAttributeTestCases | 1 | 0 | 1 | true |
| armeabi-v7a CtsNetSecConfigBasicDebugDisabledTestCases | 1 | 0 | 1 | true |
| armeabi-v7a CtsNetSecConfigBasicDebugEnabledTestCases | 1 | 0 | 1 | true |
| armeabi-v7a CtsNetSecConfigBasicDomainConfigTestCases | 3 | 0 | 3 | true |
| armeabi-v7a CtsNetSecConfigCleartextTrafficTestCases | 3 | 0 | 3 | true |
| armeabi-v7a CtsNetSecConfigDownloadManagerTestCases | 3 | 0 | 3 | true |
| armeabi-v7a CtsNetSecConfigInvalidPinTestCases | 2 | 0 | 2 | true |
| armeabi-v7a CtsNetSecConfigNestedDomainConfigTestCases | 1 | 1 | 2 | true |
| armeabi-v7a CtsNetSecConfigPrePCleartextTrafficTestCases | 3 | 0 | 3 | true |
| armeabi-v7a CtsNetSecConfigResourcesSrcTestCases | 5 | 0 | 5 | true |
| armeabi-v7a CtsNetSecPolicyUsesCleartextTrafficFalseTestCases | 6 | 0 | 6 | true |
| armeabi-v7a CtsNetSecPolicyUsesCleartextTrafficTrueTestCases | 6 | 0 | 6 | true |
| armeabi-v7a CtsNetSecPolicyUsesCleartextTrafficUnspecifiedTestCases | 6 | 0 | 6 | true |
| armeabi-v7a CtsNetTestCases | 255 | 1 | 256 | true |
| armeabi-v7a CtsNetTestCasesLegacyApi22 | 3 | 0 | 3 | true |
| armeabi-v7a CtsNetTestCasesLegacyPermission22 | 6 | 0 | 6 | true |
| armeabi-v7a CtsOmapiTestCases | 12 | 0 | 12 | true |
| armeabi-v7a CtsOpenGLTestCases | 55 | 0 | 55 | true |
| armeabi-v7a CtsOpenGlPerf2TestCases | 9 | 0 | 9 | true |
| armeabi-v7a CtsOpenGlPerfTestCases | 4 | 0 | 4 | true |
| armeabi-v7a CtsOsHostTestCases | 22 | 0 | 22 | true |
| armeabi-v7a CtsOsTestCases | 503 | 0 | 503 | true |
| armeabi-v7a CtsPdfTestCases | 5241 | 0 | 5241 | true |
| armeabi-v7a CtsPerfettoTestCases | 6 | 0 | 6 | true |
| armeabi-v7a CtsPermission2TestCases | 16 | 0 | 16 | true |
| armeabi-v7a CtsPermissionTestCases | 175 | 0 | 175 | true |
| armeabi-v7a CtsPreference2TestCases | 139 | 0 | 139 | true |
| armeabi-v7a CtsPreferenceTestCases | 4 | 0 | 4 | true |
| armeabi-v7a CtsPrintTestCases | 369 | 0 | 369 | true |
| armeabi-v7a CtsProtoTestCases | 156 | 0 | 156 | true |
| armeabi-v7a CtsProviderTestCases | 349 | 0 | 349 | true |
| armeabi-v7a CtsRenderscriptLegacyTestCases | 11 | 0 | 11 | true |
| armeabi-v7a CtsRenderscriptTestCases | 744 | 0 | 744 | true |
| armeabi-v7a CtsRsBlasTestCases | 198 | 0 | 198 | true |
| armeabi-v7a CtsRsCppTestCases | 123 | 0 | 123 | true |
| armeabi-v7a CtsSampleDeviceTestCases | 6 | 0 | 6 | true |
| armeabi-v7a CtsSampleHostTestCases | 7 | 0 | 7 | true |
| armeabi-v7a CtsSaxTestCases | 2 | 0 | 2 | true |
| armeabi-v7a CtsSeccompHostTestCases | 2 | 0 | 2 | true |
| armeabi-v7a CtsSecureElementAccessControlTestCases1 | 6 | 0 | 6 | true |
| armeabi-v7a CtsSecureElementAccessControlTestCases2 | 6 | 0 | 6 | true |
| armeabi-v7a CtsSecureElementAccessControlTestCases3 | 5 | 0 | 5 | true |
| armeabi-v7a CtsSecurityBulletinHostTestCases | 40 | 0 | 40 | true |
| armeabi-v7a CtsSecurityHostTestCases | 786 | 0 | 786 | true |
| armeabi-v7a CtsSecurityTestCases | 269 | 1 | 270 | true |
| armeabi-v7a CtsSelinuxTargetSdk25TestCases | 2 | 0 | 2 | true |
| armeabi-v7a CtsSelinuxTargetSdk27TestCases | 3 | 0 | 3 | true |
| armeabi-v7a CtsSelinuxTargetSdkCurrentTestCases | 3 | 0 | 3 | true |
| armeabi-v7a CtsSensorTestCases | 281 | 0 | 281 | true |
| armeabi-v7a CtsShortcutHostTestCases | 12 | 0 | 12 | true |
| armeabi-v7a CtsShortcutManagerTestCases | 63 | 0 | 63 | true |
| armeabi-v7a CtsSimpleCpuTestCases | 8 | 0 | 8 | true |
| armeabi-v7a CtsSimpleperfTestCases | 188 | 0 | 188 | true |
| armeabi-v7a CtsSkQPTestCases | 820 | 0 | 820 | true |
| armeabi-v7a CtsSliceTestCases | 41 | 0 | 41 | true |
| armeabi-v7a CtsSpeechTestCases | 5 | 0 | 5 | true |
| armeabi-v7a CtsStatsdHostTestCases | 65 | 0 | 65 | true |
| armeabi-v7a CtsSustainedPerformanceHostTestCases | 1 | 0 | 1 | true |
| armeabi-v7a CtsSyncAccountAccessOtherCertTestCases | 1 | 0 | 1 | true |
| armeabi-v7a CtsSyncContentHostTestCases | 1 | 0 | 1 | true |
| armeabi-v7a CtsSyncManagerTestsCases | 2 | 0 | 2 | true |
| armeabi-v7a CtsSystemApiAnnotationTestCases | 1 | 0 | 1 | true |
| armeabi-v7a CtsSystemApiSignatureTestCases | 1 | 0 | 1 | true |
| armeabi-v7a CtsSystemIntentTestCases | 1 | 0 | 1 | true |
| armeabi-v7a CtsSystemUiHostTestCases | 11 | 0 | 11 | true |
| armeabi-v7a CtsSystemUiTestCases | 6 | 0 | 6 | true |
| armeabi-v7a CtsTelecomTestCases | 239 | 0 | 239 | true |
| armeabi-v7a CtsTelecomTestCases2 | 8 | 0 | 8 | true |
| armeabi-v7a CtsTelecomTestCases3 | 3 | 0 | 3 | true |
| armeabi-v7a CtsTelephony2TestCases | 1 | 0 | 1 | true |
| armeabi-v7a CtsTelephonyTestCases | 172 | 1 | 173 | true |
| armeabi-v7a CtsTextTestCases | 1048 | 0 | 1048 | true |
| armeabi-v7a CtsThemeDeviceTestCases | 21 | 0 | 21 | true |
| armeabi-v7a CtsThemeHostTestCases | 1 | 0 | 1 | true |
| armeabi-v7a CtsToastLegacyTestCases | 8 | 0 | 8 | true |
| armeabi-v7a CtsToastTestCases | 3 | 0 | 3 | true |
| armeabi-v7a CtsTransitionTestCases | 106 | 0 | 106 | true |
| armeabi-v7a CtsTrustedVoiceHostTestCases | 1 | 0 | 1 | true |
| armeabi-v7a CtsTvProviderTestCases | 2 | 0 | 2 | true |
| armeabi-v7a CtsTvTestCases | 75 | 0 | 75 | true |
| armeabi-v7a CtsUiAutomationTestCases | 9 | 0 | 9 | true |
| armeabi-v7a CtsUiDeviceTestCases | 3 | 0 | 3 | true |
| armeabi-v7a CtsUiRenderingTestCases | 229 | 0 | 229 | true |
| armeabi-v7a CtsUidIsolationTestCases | 2 | 0 | 2 | true |
| armeabi-v7a CtsUsageStatsTestCases | 28 | 0 | 28 | true |
| armeabi-v7a CtsUsbTests | 1 | 0 | 1 | true |
| armeabi-v7a CtsUtilTestCases | 286 | 0 | 286 | true |
| armeabi-v7a CtsVideoTestCases | 363 | 0 | 363 | true |
| armeabi-v7a CtsViewTestCases | 963 | 0 | 963 | true |
| armeabi-v7a CtsVmTestCases | 118 | 0 | 118 | true |
| armeabi-v7a CtsVoiceInteractionTestCases | 2 | 0 | 2 | true |
| armeabi-v7a CtsVoiceSettingsTestCases | 3 | 0 | 3 | true |
| armeabi-v7a CtsVrTestCases | 16 | 0 | 16 | true |
| armeabi-v7a CtsWebkitTestCases | 238 | 0 | 238 | true |
| armeabi-v7a CtsWidgetTestCases | 3592 | 0 | 3592 | true |
| armeabi-v7a CtsWindowManagerDeviceTestCases | 51 | 0 | 51 | true |
| armeabi-v7a CtsWrapNoWrapTestCases | 1 | 0 | 1 | true |
| armeabi-v7a CtsWrapWrapDebugMallocDebugTestCases | 1 | 0 | 1 | true |
| armeabi-v7a CtsWrapWrapDebugTestCases | 1 | 0 | 1 | true |
| armeabi-v7a CtsWrapWrapNoDebugTestCases | 1 | 0 | 1 | true |
| armeabi-v7a cts-system-all.api | 1 | 0 | 1 | true |
| armeabi-v7a signed-CtsSecureElementAccessControlTestCases1 | 6 | 0 | 6 | true |
| armeabi-v7a signed-CtsSecureElementAccessControlTestCases2 | 6 | 0 | 6 | true |
| armeabi-v7a signed-CtsSecureElementAccessControlTestCases3 | 5 | 0 | 5 | true |
| armeabi-v7a vm-tests-tf | 3126 | 0 | 3126 | true |
| armeabi-v7a CtsDeqpTestCases | ||
| Test | Result | Details |
|---|---|---|
| dEQP-GLES3.functional.flush_finish#finish_wait |
fail
|
=== with config {glformat=rgba8888d24s8ms0,rotation=unspecified,surfacetype=window,required=true} ===
|
| armeabi-v7a CtsIncidentHostTestCases | ||
| Test | Result | Details |
|---|---|---|
| com.android.server.cts.BatteryStatsIncidentTest#testBatteryStatsServiceDump |
fail
|
junit.framework.AssertionFailedError
|
| com.android.server.cts.IncidentdTest#testIncidentReportDumpAuto |
fail
|
junit.framework.AssertionFailedError
|
| com.android.server.cts.IncidentdTest#testIncidentReportDumpExplicit |
fail
|
junit.framework.AssertionFailedError
|
| com.android.server.cts.IncidentdTest#testIncidentReportDumpLocal |
fail
|
junit.framework.AssertionFailedError
|
| armeabi-v7a CtsLibcoreTestCases | ||
| Test | Result | Details |
|---|---|---|
| libcore.java.net.ConcurrentCloseTest#test_connect |
fail
|
junit.framework.ComparisonFailure: expected:<[Socket closed]> but was:<[failed to connect to /192.0.2.0 (port 80) from /:: (port 0): connect failed: ENETUNREACH (Network is unreachable)]>
|
| libcore.java.net.ConcurrentCloseTest#test_connect_nonBlocking |
fail
|
junit.framework.ComparisonFailure: expected:<[Socket closed]> but was:<[Network is unreachable]>
|
| libcore.java.net.ConcurrentCloseTest#test_connect_timeout |
fail
|
junit.framework.ComparisonFailure: expected:<[Socket closed]> but was:<[failed to connect to /192.0.2.0 (port 80) from /:: (port 0) after 3600000ms: connect failed: ENETUNREACH (Network is unreachable)]>
|
| libcore.java.net.OldSocketTest#test_connectLjava_net_SocketAddressI |
fail
|
junit.framework.AssertionFailedError: Wrong exception when connecting to address nobody listening on with short timeout 200: java.net.ConnectException: failed to connect to /192.0.2.0 (port 0) from /:: (port 0) after 200ms: connect failed: ENETUNREACH (Network is unreachable)
|
| libcore.java.net.SocketTest#testCloseDuringConnect |
fail
|
junit.framework.AssertionFailedError: connectUnblocked=[true], workerFailure=[Unexpected SocketException message: failed to connect to /192.0.2.0 (port 80) from /:: (port 0): connect failed: ENETUNREACH (Network is unreachable)]
|
| libcore.java.net.SocketTest#testSocketTestAllAddresses |
fail
|
junit.framework.AssertionFailedError: Loopback DNS record is unreachable or is invalid.
|
| libcore.java.net.SocketTimeoutTest#testSocketConnectTimeout |
fail
|
java.net.ConnectException: failed to connect to /192.0.2.0 (port 0) from /:: (port 0) after 500ms: connect failed: ENETUNREACH (Network is unreachable)
|
| armeabi-v7a CtsNetSecConfigNestedDomainConfigTestCases | ||
| Test | Result | Details |
|---|---|---|
| android.security.net.config.cts.NestedDomainConfigTest#testNestedDomainConfig |
fail
|
java.net.UnknownHostException: Unable to resolve host "developer.android.com": No address associated with hostname
|
| armeabi-v7a CtsNetTestCases | ||
| Test | Result | Details |
|---|---|---|
| android.net.cts.DnsTest#testDnsWorks |
fail
|
junit.framework.AssertionFailedError: Default network did not provide IPv6 connectivity after 5000ms. Please connect to an IPv6-capable network. lp=null
|
| armeabi-v7a CtsSecurityTestCases | ||
| Test | Result | Details |
|---|---|---|
| android.security.cts.EncryptionTest#testEncryption |
fail
|
junit.framework.AssertionFailedError: Device encryption is required
|
| armeabi-v7a CtsTelephonyTestCases | ||
| Test | Result | Details |
|---|---|---|
| android.telephony.cts.CarrierConfigManagerTest#testNotifyConfigChangedForSubId |
fail
|
junit.framework.AssertionFailedError: Expected SecurityException. App doesn't have carrier privileges.
|